Reaction Details
TargetTyrosine-protein kinase JAK2
LigandBDBM50208589
Substrate/Competitorn/a
Meas. Tech.ChEMBL_1633046 (CHEMBL3875838)
IC50 50±n/a nM
Citation Phuangsawai, OBeswick, PRatanabunyong, STabtimmai, LSuphakun, PObounchoey, PSrisook, PHorata, NChuckowree, IHannongbua, SWard, SEChoowongkomon, KGleeson, MP Evaluation of the anti-malarial activity and cytotoxicity of 2,4-diamino-pyrimidine-based kinase inhibitors. Eur J Med Chem124:896-905 (2016) 
 
Tyrosine-protein kinase JAK2
Name:Tyrosine-protein kinase JAK2
Type:Protein
Mol. Mass.:130684.68
Organism:Homo sapiens (Human)
Description:O60674
Residue:1132
BDBM50208589
NameBDBM50208589
Synonyms:CHEMBL3884848
TypeSmall organic molecule
Emp. Form.C23H28N6
Mol. Mass.388.5086
SMILESCN1CCN(CC1)c1ccc(Nc2nccc(Nc3cccc(C)c3)n2)cc1C