Reaction Details
TargetDual specificity protein kinase CLK4
LigandBDBM50208711
Substrate/Competitorn/a
Meas. Tech.ChEMBL_1633069 (CHEMBL3875861)
IC50 22±n/a nM
Citation Labrière, CLozach, OBlairvacq, MMeijer, LGuillou, C Further investigation of Paprotrain: Towards the conception of selective and multi-targeted CNS kinase inhibitors. Eur J Med Chem124:920-934 (2016) 
 
Dual specificity protein kinase CLK4
Name:Dual specificity protein kinase CLK4
Type:Serine/threonine-protein kinase
Mol. Mass.:57522.53
Organism:Homo sapiens (Human)
Description:gi_10190706
Residue:481
BDBM50208711
NameBDBM50208711
Synonyms:CHEMBL3885335
TypeSmall organic molecule
Emp. Form.C20H17N3O2
Mol. Mass.331.3679
SMILESCOc1ccc2[nH]cc(-c3cc4cnccc4cc3NC(C)=O)c2c1