Reaction Details
TargetDual specificity protein kinase CLK4
LigandBDBM50208625
Substrate/Competitorn/a
Meas. Tech.ChEMBL_1633069 (CHEMBL3875861)
IC50 40±n/a nM
Citation Labrière, CLozach, OBlairvacq, MMeijer, LGuillou, C Further investigation of Paprotrain: Towards the conception of selective and multi-targeted CNS kinase inhibitors. Eur J Med Chem124:920-934 (2016) 
 
Dual specificity protein kinase CLK4
Name:Dual specificity protein kinase CLK4
Type:Serine/threonine-protein kinase
Mol. Mass.:57522.53
Organism:Homo sapiens (Human)
Description:gi_10190706
Residue:481
BDBM50208625
NameBDBM50208625
Synonyms:CHEMBL3885431
TypeSmall organic molecule
Emp. Form.C17H11N3O
Mol. Mass.273.2887
SMILESCOc1cccc2c1[nH]c1c2c(cc2cnccc12)C#N