Reaction Details
TargetDual specificity protein kinase CLK2
LigandBDBM50208635
Substrate/Competitorn/a
Meas. Tech.ChEMBL_1633067 (CHEMBL3875859)
IC50 80±n/a nM
Citation Labrière, CLozach, OBlairvacq, MMeijer, LGuillou, C Further investigation of Paprotrain: Towards the conception of selective and multi-targeted CNS kinase inhibitors. Eur J Med Chem124:920-934 (2016) 
 
Dual specificity protein kinase CLK2
Name:Dual specificity protein kinase CLK2
Type:n/a
Mol. Mass.:60128.79
Organism:Homo sapiens (Human)
Description:P49760
Residue:499
BDBM50208635
NameBDBM50208635
Synonyms:CHEMBL3883660
TypeSmall organic molecule
Emp. Form.C17H11N3O
Mol. Mass.273.2887
SMILESCOc1ccc2c(c1)[nH]c1c2c(cc2cnccc12)C#N