Reaction Details
TargetDual specificity protein kinase CLK3
LigandBDBM50208626
Substrate/Competitorn/a
Meas. Tech.ChEMBL_1633068 (CHEMBL3875860)
IC50 320±n/a nM
Citation Labrière, CLozach, OBlairvacq, MMeijer, LGuillou, C Further investigation of Paprotrain: Towards the conception of selective and multi-targeted CNS kinase inhibitors. Eur J Med Chem124:920-934 (2016) 
 
Dual specificity protein kinase CLK3
Name:Dual specificity protein kinase CLK3
Type:Protein
Mol. Mass.:73570.11
Organism:Homo sapiens (Human)
Description:n/a
Residue:638
BDBM50208626
NameBDBM50208626
Synonyms:CHEMBL3884821
TypeSmall organic molecule
Emp. Form.C18H13N3O2
Mol. Mass.303.3147
SMILESCOc1ccc2c(c1)[nH]c1c2c(cc2cncc(OC)c12)C#N