Reaction Details
TargetDual specificity protein kinase CLK4
LigandBDBM50208715
Substrate/Competitorn/a
Meas. Tech.ChEMBL_1633069 (CHEMBL3875861)
IC50 71±n/a nM
Citation Labrière, CLozach, OBlairvacq, MMeijer, LGuillou, C Further investigation of Paprotrain: Towards the conception of selective and multi-targeted CNS kinase inhibitors. Eur J Med Chem124:920-934 (2016) 
 
Dual specificity protein kinase CLK4
Name:Dual specificity protein kinase CLK4
Type:Serine/threonine-protein kinase
Mol. Mass.:57522.53
Organism:Homo sapiens (Human)
Description:gi_10190706
Residue:481
BDBM50208715
NameBDBM50208715
Synonyms:CHEMBL3884570
TypeSmall organic molecule
Emp. Form.C16H12N4O
Mol. Mass.276.2927
SMILESCOc1ccc2c(c[nH]c2n1)C(=C\c1cccnc1)\C#N