Reaction Details
TargetCyclin-dependent kinase 5 activator 1
LigandBDBM50208626
Substrate/Competitorn/a
Meas. Tech.ChEMBL_1633062 (CHEMBL3875854)
IC50 6400±n/a nM
Citation Labrière, CLozach, OBlairvacq, MMeijer, LGuillou, C Further investigation of Paprotrain: Towards the conception of selective and multi-targeted CNS kinase inhibitors. Eur J Med Chem124:920-934 (2016) 
 
Cyclin-dependent kinase 5 activator 1
Name:Cyclin-dependent kinase 5 activator 1
Type:Protein Complex
Mol. Mass.:n/a
Description:n/a
Components:This complex has 2 components.
Component 1
Name:Cyclin-dependent kinase 5
Synonyms:CDK5 CDKN5 Cyclin-dependent kinase 5 (CDK5/ p25) Cyclin-dependent-like kinase 5 PSSALRE Tau protein kinase II catalytic subunit
Type:Enzyme Subunit
Mol. Mass.:33308.61
Organism:Homo sapiens (Human)
Description:n/a
Residue:292
Component 2
Name:Cyclin-dependent kinase 5 activator 1
Synonyms:CD5R1_HUMAN CDK5R1 Cyclin-dependent kinase 5 (CDK5/p25) NCK5A p35
Type:Enzyme Subunit
Mol. Mass.:34077.43
Organism:Homo sapiens (Human)
Description:Q15078
Residue:307
BDBM50208626
NameBDBM50208626
Synonyms:CHEMBL3884821
TypeSmall organic molecule
Emp. Form.C18H13N3O2
Mol. Mass.303.3147
SMILESCOc1ccc2c(c1)[nH]c1c2c(cc2cncc(OC)c12)C#N