Reaction Details
TargetDual specificity protein kinase CLK4
LigandBDBM50208709
Substrate/Competitorn/a
Meas. Tech.ChEMBL_1633069 (CHEMBL3875861)
IC50 57±n/a nM
Citation Labrière, CLozach, OBlairvacq, MMeijer, LGuillou, C Further investigation of Paprotrain: Towards the conception of selective and multi-targeted CNS kinase inhibitors. Eur J Med Chem124:920-934 (2016) 
 
Dual specificity protein kinase CLK4
Name:Dual specificity protein kinase CLK4
Type:Serine/threonine-protein kinase
Mol. Mass.:57522.53
Organism:Homo sapiens (Human)
Description:gi_10190706
Residue:481
BDBM50208709
NameBDBM50208709
Synonyms:CHEMBL3883639
TypeSmall organic molecule
Emp. Form.C17H11N3O
Mol. Mass.273.2887
SMILESCOc1ccc2[nH]c3c(c(cc4cnccc34)C#N)c2c1