Reaction Details
TargetMAP/microtubule affinity-regulating kinase 4
LigandBDBM50208921
Substrate/Competitorn/a
Meas. Tech.ChEMBL_1633232 (CHEMBL3876024)
IC50 3760±n/a nM
Citation Katz, JDHaidle, AChilders, KKZabierek, AAJewell, JPHou, YAltman, MDSzewczak, AChen, DHarsch, AHayashi, MWarren, LHutton, MNuthall, HSu, HPMunshi, SStanton, MGDavies, IWMunoz, BNorthrup, A Structure guided design of a series of selective pyrrolopyrimidinone MARK inhibitors. Bioorg Med Chem Lett27:114-120 (2017) 
 
MAP/microtubule affinity-regulating kinase 4
Name:MAP/microtubule affinity-regulating kinase 4
Type:PROTEIN
Mol. Mass.:82561.08
Organism:Homo sapiens (Human)
Description:ChEMBL_774620
Residue:752
BDBM50208921
NameBDBM50208921
Synonyms:CHEMBL3884929
TypeSmall organic molecule
Emp. Form.C22H23N5O
Mol. Mass.373.4509
SMILESCC(C)(N1C(=O)C(C)(C)c2cnc(Nc3cccnc3)nc12)c1ccccc1