Reaction Details
TargetG protein-coupled receptor kinase 4
LigandBDBM50208911
Substrate/Competitorn/a
Meas. Tech.ChEMBL_1633311 (CHEMBL3876103)
IC50 10000±n/a nM
Citation Katz, JDHaidle, AChilders, KKZabierek, AAJewell, JPHou, YAltman, MDSzewczak, AChen, DHarsch, AHayashi, MWarren, LHutton, MNuthall, HSu, HPMunshi, SStanton, MGDavies, IWMunoz, BNorthrup, A Structure guided design of a series of selective pyrrolopyrimidinone MARK inhibitors. Bioorg Med Chem Lett27:114-120 (2017) 
 
G protein-coupled receptor kinase 4
Name:G protein-coupled receptor kinase 4
Type:PROTEIN
Mol. Mass.:66590.61
Organism:Homo sapiens (Human)
Description:ChEMBL_774219
Residue:578
BDBM50208911
NameBDBM50208911
Synonyms:CHEMBL3884319
TypeSmall organic molecule
Emp. Form.C23H22N4O2
Mol. Mass.386.4464
SMILESCC1(C)C(=O)N([C@H]2CCc3c2cccc3O)c2nc(Nc3ccccc3)ncc12