Reaction Details
TargetSRSF protein kinase 1
LigandBDBM50208911
Substrate/Competitorn/a
Meas. Tech.ChEMBL_1633284 (CHEMBL3876076)
IC50 10000±n/a nM
Citation Katz, JDHaidle, AChilders, KKZabierek, AAJewell, JPHou, YAltman, MDSzewczak, AChen, DHarsch, AHayashi, MWarren, LHutton, MNuthall, HSu, HPMunshi, SStanton, MGDavies, IWMunoz, BNorthrup, A Structure guided design of a series of selective pyrrolopyrimidinone MARK inhibitors. Bioorg Med Chem Lett27:114-120 (2017) 
 
SRSF protein kinase 1
Name:SRSF protein kinase 1
Type:Protein
Mol. Mass.:74318.38
Organism:Homo sapiens (Human)
Description:Q96SB4
Residue:655
BDBM50208911
NameBDBM50208911
Synonyms:CHEMBL3884319
TypeSmall organic molecule
Emp. Form.C23H22N4O2
Mol. Mass.386.4464
SMILESCC1(C)C(=O)N([C@H]2CCc3c2cccc3O)c2nc(Nc3ccccc3)ncc12