Reaction Details
TargetMAP/microtubule affinity-regulating kinase 4
LigandBDBM50208918
Substrate/Competitorn/a
Meas. Tech.ChEMBL_1633232 (CHEMBL3876024)
IC50 8600±n/a nM
Citation Katz, JDHaidle, AChilders, KKZabierek, AAJewell, JPHou, YAltman, MDSzewczak, AChen, DHarsch, AHayashi, MWarren, LHutton, MNuthall, HSu, HPMunshi, SStanton, MGDavies, IWMunoz, BNorthrup, A Structure guided design of a series of selective pyrrolopyrimidinone MARK inhibitors. Bioorg Med Chem Lett27:114-120 (2017) 
 
MAP/microtubule affinity-regulating kinase 4
Name:MAP/microtubule affinity-regulating kinase 4
Type:PROTEIN
Mol. Mass.:82561.08
Organism:Homo sapiens (Human)
Description:ChEMBL_774620
Residue:752
BDBM50208918
NameBDBM50208918
Synonyms:CHEMBL3883802
TypeSmall organic molecule
Emp. Form.C20H24N4O
Mol. Mass.336.4308
SMILESCC1(C)C(=O)N(C2CCCCC2)c2nc(Nc3ccccc3)ncc12