Reaction Details
TargetMAP/microtubule affinity-regulating kinase 4
LigandBDBM50208934
Substrate/Competitorn/a
Meas. Tech.ChEMBL_1633232 (CHEMBL3876024)
IC50>10000±n/a nM
Citation Katz, JDHaidle, AChilders, KKZabierek, AAJewell, JPHou, YAltman, MDSzewczak, AChen, DHarsch, AHayashi, MWarren, LHutton, MNuthall, HSu, HPMunshi, SStanton, MGDavies, IWMunoz, BNorthrup, A Structure guided design of a series of selective pyrrolopyrimidinone MARK inhibitors. Bioorg Med Chem Lett27:114-120 (2017) 
 
MAP/microtubule affinity-regulating kinase 4
Name:MAP/microtubule affinity-regulating kinase 4
Type:PROTEIN
Mol. Mass.:82561.08
Organism:Homo sapiens (Human)
Description:ChEMBL_774620
Residue:752
BDBM50208934
NameBDBM50208934
Synonyms:CHEMBL3884098
TypeSmall organic molecule
Emp. Form.C20H26N4
Mol. Mass.322.4472
SMILESCC1(C)CN(C2CCCCC2)c2nc(Nc3ccccc3)ncc12