Reaction Details
TargetNeuromedin-K receptor
LigandBDBM50051295
Substrate/Competitorn/a
Meas. Tech.ChEMBL_1633582 (CHEMBL3876374)
IC50 6.7±n/a nM
Citation Gunia-Krzyzak, AZelaszczyk, DRapacz, AZeslawska, EWaszkielewicz, AMPanczyk, KSloczynska, KPekala, ENitek, WFilipek, BMarona, H Structure-anticonvulsant activity studies in the group of (E)-N-cinnamoyl aminoalkanols derivatives monosubstituted in phenyl ring with 4-Cl, 4-CH Bioorg Med Chem25:471-482 (2017) 
 
Neuromedin-K receptor
Name:Neuromedin-K receptor
Type:Enzyme
Mol. Mass.:52221.96
Organism:Homo sapiens (Human)
Description:P29371
Residue:465
BDBM50051295
NameBDBM50051295
Synonyms:(S)-3-methyl-2-phenyl-N-(1-phenylpropyl)quinoline-4-carboxamide CHEMBL10284 | SB-222200
TypeSmall organic molecule
Emp. Form.C26H24N2O
Mol. Mass.380.4816
SMILESCC[C@H](NC(=O)c1c(C)c(nc2ccccc12)-c1ccccc1)c1ccccc1