Reaction Details
TargetHistamine H2 receptor
LigandBDBM50103595
Substrate/Competitorn/a
Meas. Tech.ChEMBL_1633572 (CHEMBL3876364)
IC50 1000±n/a nM
Citation Gunia-Krzyzak, AZelaszczyk, DRapacz, AZeslawska, EWaszkielewicz, AMPanczyk, KSloczynska, KPekala, ENitek, WFilipek, BMarona, H Structure-anticonvulsant activity studies in the group of (E)-N-cinnamoyl aminoalkanols derivatives monosubstituted in phenyl ring with 4-Cl, 4-CH Bioorg Med Chem25:471-482 (2017) 
 
Histamine H2 receptor
Name:Histamine H2 receptor
Type:G Protein-Coupled Receptor (GPCR)
Mol. Mass.:40115.31
Organism:Homo sapiens (Human)
Description:n/a
Residue:359
BDBM50103595
NameBDBM50103595
Synonyms:Brumetadina Cimetidine Tagamet HB Valmagen
TypeSmall organic molecule
Emp. Form.C10H16N6S
Mol. Mass.252.339
SMILESCN\C(NC#N)=N/CCSCc1nc[nH]c1C