Reaction Details
TargetSphingosine 1-phosphate receptor 4
LigandBDBM50209016
Substrate/Competitorn/a
Meas. Tech.ChEBML_1633657
EC50 3100±n/a nM
Citation Hur, WRosen, HGray, NS A benzo[b]thiophene-based selective type 4 S1P receptor agonist. Bioorg Med Chem Lett27:1-5 (2017) 
 
Sphingosine 1-phosphate receptor 4
Name:Sphingosine 1-phosphate receptor 4
Type:G Protein-Coupled Receptor (GPCR)
Mol. Mass.:41647.39
Organism:Homo sapiens (Human)
Description:n/a
Residue:384
BDBM50209016
NameBDBM50209016
Synonyms:CHEMBL3885229
TypeSmall organic molecule
Emp. Form.C20H22N2O2S
Mol. Mass.354.466
SMILESCCc1ccccc1-c1cccc2cc(CNCC(N)C(O)=O)sc12