Reaction Details
TargetSphingosine 1-phosphate receptor 5
LigandBDBM50209020
Substrate/Competitorn/a
Meas. Tech.ChEBML_1633656
EC50 769±n/a nM
Citation Hur, WRosen, HGray, NS A benzo[b]thiophene-based selective type 4 S1P receptor agonist. Bioorg Med Chem Lett27:1-5 (2017) 
 
Sphingosine 1-phosphate receptor 5
Name:Sphingosine 1-phosphate receptor 5
Type:G Protein-Coupled Receptor (GPCR)
Mol. Mass.:41796.42
Organism:Homo sapiens (Human)
Description:n/a
Residue:398
BDBM50209020
NameBDBM50209020
Synonyms:CHEMBL3884077
TypeSmall organic molecule
Emp. Form.C27H21NO2S
Mol. Mass.423.526
SMILESOC(=O)Cc1cccc(NCc2cc3cc(ccc3s2)-c2ccc3ccccc3c2)c1