Reaction Details
TargetSphingosine 1-phosphate receptor 4
LigandBDBM50209025
Substrate/Competitorn/a
Meas. Tech.ChEBML_1633657
EC50>100000±n/a nM
Citation Hur, WRosen, HGray, NS A benzo[b]thiophene-based selective type 4 S1P receptor agonist. Bioorg Med Chem Lett27:1-5 (2017) 
 
Sphingosine 1-phosphate receptor 4
Name:Sphingosine 1-phosphate receptor 4
Type:G Protein-Coupled Receptor (GPCR)
Mol. Mass.:41647.39
Organism:Homo sapiens (Human)
Description:n/a
Residue:384
BDBM50209025
NameBDBM50209025
Synonyms:CHEMBL3883597
TypeSmall organic molecule
Emp. Form.C23H19NO2S
Mol. Mass.373.467
SMILESOC(=O)C1CN(Cc2cc3cc(ccc3s2)-c2ccc3ccccc3c2)C1