Reaction Details
TargetSphingosine 1-phosphate receptor 5
LigandBDBM50209041
Substrate/Competitorn/a
Meas. Tech.ChEMBL_1633656 (CHEMBL3876448)
EC50 1670±n/a nM
Citation Hur, WRosen, HGray, NS A benzo[b]thiophene-based selective type 4 S1P receptor agonist. Bioorg Med Chem Lett27:1-5 (2017) 
 
Sphingosine 1-phosphate receptor 5
Name:Sphingosine 1-phosphate receptor 5
Type:G Protein-Coupled Receptor (GPCR)
Mol. Mass.:41796.42
Organism:Homo sapiens (Human)
Description:n/a
Residue:398
BDBM50209041
NameBDBM50209041
Synonyms:CHEMBL3884292
TypeSmall organic molecule
Emp. Form.C27H21NO2S
Mol. Mass.423.526
SMILESOC(=O)Cc1cccc(NCc2cc3cccc(-c4ccc5ccccc5c4)c3s2)c1