Reaction Details
TargetSphingosine 1-phosphate receptor 4
LigandBDBM50209044
Substrate/Competitorn/a
Meas. Tech.ChEMBL_1633657 (CHEMBL3876449)
EC50>100000±n/a nM
Citation Hur, WRosen, HGray, NS A benzo[b]thiophene-based selective type 4 S1P receptor agonist. Bioorg Med Chem Lett27:1-5 (2017) 
 
Sphingosine 1-phosphate receptor 4
Name:Sphingosine 1-phosphate receptor 4
Type:G Protein-Coupled Receptor (GPCR)
Mol. Mass.:41647.39
Organism:Homo sapiens (Human)
Description:n/a
Residue:384
BDBM50209044
NameBDBM50209044
Synonyms:CHEMBL3884011
TypeSmall organic molecule
Emp. Form.C27H21NO2S
Mol. Mass.423.526
SMILESOC(=O)c1ccc(CNCc2cc3c(cccc3s2)-c2ccc3ccccc3c2)cc1