Reaction Details
TargetSphingosine 1-phosphate receptor 4
LigandBDBM50209054
Substrate/Competitorn/a
Meas. Tech.ChEMBL_1633657 (CHEMBL3876449)
EC50 1930±n/a nM
Citation Hur, WRosen, HGray, NS A benzo[b]thiophene-based selective type 4 S1P receptor agonist. Bioorg Med Chem Lett27:1-5 (2017) 
 
Sphingosine 1-phosphate receptor 4
Name:Sphingosine 1-phosphate receptor 4
Type:G Protein-Coupled Receptor (GPCR)
Mol. Mass.:41647.39
Organism:Homo sapiens (Human)
Description:n/a
Residue:384
BDBM50209054
NameBDBM50209054
Synonyms:CHEMBL3885357
TypeSmall organic molecule
Emp. Form.C24H23NO3S
Mol. Mass.405.509
SMILESCOc1ccc2cc(ccc2c1)-c1cccc2cc(CNCCCC(O)=O)sc12