Reaction Details
TargetSphingosine 1-phosphate receptor 4
LigandBDBM50209074
Substrate/Competitorn/a
Meas. Tech.ChEMBL_1633657 (CHEMBL3876449)
EC50 211±n/a nM
Citation Hur, WRosen, HGray, NS A benzo[b]thiophene-based selective type 4 S1P receptor agonist. Bioorg Med Chem Lett27:1-5 (2017) 
 
Sphingosine 1-phosphate receptor 4
Name:Sphingosine 1-phosphate receptor 4
Type:G Protein-Coupled Receptor (GPCR)
Mol. Mass.:41647.39
Organism:Homo sapiens (Human)
Description:n/a
Residue:384
BDBM50209074
NameBDBM50209074
Synonyms:CHEMBL3885331
TypeSmall organic molecule
Emp. Form.C23H21NO2S
Mol. Mass.375.483
SMILESOC(=O)CCCNCc1cc2c(cccc2s1)-c1ccc2ccccc2c1