Reaction Details
TargetSphingosine 1-phosphate receptor 3
LigandBDBM50209027
Substrate/Competitorn/a
Meas. Tech.ChEMBL_1633661 (CHEMBL3876453)
EC50>100000±n/a nM
Citation Hur, WRosen, HGray, NS A benzo[b]thiophene-based selective type 4 S1P receptor agonist. Bioorg Med Chem Lett27:1-5 (2017) 
 
Sphingosine 1-phosphate receptor 3
Name:Sphingosine 1-phosphate receptor 3
Type:G Protein-Coupled Receptor (GPCR)
Mol. Mass.:42278.13
Organism:Homo sapiens (Human)
Description:Q99500
Residue:378
BDBM50209027
NameBDBM50209027
Synonyms:CHEMBL3884038
TypeSmall organic molecule
Emp. Form.C23H21NO2S
Mol. Mass.375.483
SMILESOC(=O)CCCNCc1cc2cccc(-c3ccc4ccccc4c3)c2s1