Reaction Details
TargetSphingosine 1-phosphate receptor 1
LigandBDBM50209035
Substrate/Competitorn/a
Meas. Tech.ChEMBL_1633659 (CHEMBL3876451)
EC50>100000±n/a nM
Citation Hur, WRosen, HGray, NS A benzo[b]thiophene-based selective type 4 S1P receptor agonist. Bioorg Med Chem Lett27:1-5 (2017) 
 
Sphingosine 1-phosphate receptor 1
Name:Sphingosine 1-phosphate receptor 1
Type:Enzyme
Mol. Mass.:42836.02
Organism:Homo sapiens (Human)
Description:P21453
Residue:382
BDBM50209035
NameBDBM50209035
Synonyms:CHEMBL3883447
TypeSmall organic molecule
Emp. Form.C21H17NO2S
Mol. Mass.347.43
SMILESOC(=O)CNCc1cc2c(cccc2s1)-c1ccc2ccccc2c1