Reaction Details
TargetSphingosine 1-phosphate receptor 5
LigandBDBM50209019
Substrate/Competitorn/a
Meas. Tech.ChEMBL_1633656 (CHEMBL3876448)
EC50 4770±n/a nM
Citation Hur, WRosen, HGray, NS A benzo[b]thiophene-based selective type 4 S1P receptor agonist. Bioorg Med Chem Lett27:1-5 (2017) 
 
Sphingosine 1-phosphate receptor 5
Name:Sphingosine 1-phosphate receptor 5
Type:G Protein-Coupled Receptor (GPCR)
Mol. Mass.:41796.42
Organism:Homo sapiens (Human)
Description:n/a
Residue:398
BDBM50209019
NameBDBM50209019
Synonyms:CHEMBL3883998
TypeSmall organic molecule
Emp. Form.C25H23NO2S
Mol. Mass.401.521
SMILESCCc1ccccc1-c1cccc2sc(CNc3ccc(CC(O)=O)cc3)cc12