Reaction Details
TargetSphingosine 1-phosphate receptor 5
LigandBDBM50209062
Substrate/Competitorn/a
Meas. Tech.ChEMBL_1633656 (CHEMBL3876448)
EC50 506±n/a nM
Citation Hur, WRosen, HGray, NS A benzo[b]thiophene-based selective type 4 S1P receptor agonist. Bioorg Med Chem Lett27:1-5 (2017) 
 
Sphingosine 1-phosphate receptor 5
Name:Sphingosine 1-phosphate receptor 5
Type:G Protein-Coupled Receptor (GPCR)
Mol. Mass.:41796.42
Organism:Homo sapiens (Human)
Description:n/a
Residue:398
BDBM50209062
NameBDBM50209062
Synonyms:CHEMBL3883579
TypeSmall organic molecule
Emp. Form.C23H19NO2S
Mol. Mass.373.467
SMILESOC(=O)C1CN(Cc2cc3cccc(-c4ccc5ccccc5c4)c3s2)C1