Reaction Details
TargetSphingosine 1-phosphate receptor 1
LigandBDBM50209044
Substrate/Competitorn/a
Meas. Tech.ChEMBL_1633659 (CHEMBL3876451)
EC50>100000±n/a nM
Citation Hur, WRosen, HGray, NS A benzo[b]thiophene-based selective type 4 S1P receptor agonist. Bioorg Med Chem Lett27:1-5 (2017) 
 
Sphingosine 1-phosphate receptor 1
Name:Sphingosine 1-phosphate receptor 1
Type:Enzyme
Mol. Mass.:42836.02
Organism:Homo sapiens (Human)
Description:P21453
Residue:382
BDBM50209044
NameBDBM50209044
Synonyms:CHEMBL3884011
TypeSmall organic molecule
Emp. Form.C27H21NO2S
Mol. Mass.423.526
SMILESOC(=O)c1ccc(CNCc2cc3c(cccc3s2)-c2ccc3ccccc3c2)cc1