Reaction Details
TargetSphingosine 1-phosphate receptor 4
LigandBDBM50209059
Substrate/Competitorn/a
Meas. Tech.ChEMBL_1633657 (CHEMBL3876449)
EC50 3920±n/a nM
Citation Hur, WRosen, HGray, NS A benzo[b]thiophene-based selective type 4 S1P receptor agonist. Bioorg Med Chem Lett27:1-5 (2017) 
 
Sphingosine 1-phosphate receptor 4
Name:Sphingosine 1-phosphate receptor 4
Type:G Protein-Coupled Receptor (GPCR)
Mol. Mass.:41647.39
Organism:Homo sapiens (Human)
Description:n/a
Residue:384
BDBM50209059
NameBDBM50209059
Synonyms:CHEMBL3883947
TypeSmall organic molecule
Emp. Form.C20H19NO4S
Mol. Mass.369.434
SMILESOC(=O)CCCNCc1cc2cccc(-c3ccc4OCOc4c3)c2s1