Reaction Details
TargetSphingosine 1-phosphate receptor 4
LigandBDBM50209057
Substrate/Competitorn/a
Meas. Tech.ChEMBL_1633657 (CHEMBL3876449)
EC50 19900±n/a nM
Citation Hur, WRosen, HGray, NS A benzo[b]thiophene-based selective type 4 S1P receptor agonist. Bioorg Med Chem Lett27:1-5 (2017) 
 
Sphingosine 1-phosphate receptor 4
Name:Sphingosine 1-phosphate receptor 4
Type:G Protein-Coupled Receptor (GPCR)
Mol. Mass.:41647.39
Organism:Homo sapiens (Human)
Description:n/a
Residue:384
BDBM50209057
NameBDBM50209057
Synonyms:CHEMBL3884099
TypeSmall organic molecule
Emp. Form.C20H21NO2S
Mol. Mass.339.451
SMILESCc1ccc(cc1)-c1cccc2cc(CNCCCC(O)=O)sc12