Reaction Details
TargetMAP/microtubule affinity-regulating kinase 3
LigandBDBM50209077
Substrate/Competitorn/a
Meas. Tech.ChEMBL_1633686 (CHEMBL3876478)
IC50 80±n/a nM
Citation Haidle, AMChilders, KKZabierek, AAKatz, JDJewell, JPHou, YAltman, MDSzewczak, AChen, DHarsch, AHayashi, MWarren, LHutton, MNuthall, HStanton, MGDavies, IWMunoz, BNorthrup, A MARK inhibitors: Declaring a No-Go decision on a chemical series based on extensive DMPK experimentation. Bioorg Med Chem Lett27:109-113 (2017) 
 
MAP/microtubule affinity-regulating kinase 3
Name:MAP/microtubule affinity-regulating kinase 3
Type:Protein
Mol. Mass.:84525.94
Organism:Homo sapiens (Human)
Description:P27448
Residue:753
BDBM50209077
NameBDBM50209077
Synonyms:CHEMBL3884116
TypeSmall organic molecule
Emp. Form.C21H25N7O
Mol. Mass.391.4695
SMILESCC[C@H](C)N1C(=O)C(C)(C)c2cnc(Nc3ccc(cc3)-c3nnc(C)[nH]3)nc12