Reaction Details
TargetMetabotropic glutamate receptor 2
LigandBDBM50209142
Substrate/Competitorn/a
Meas. Tech.ChEMBL_1633737 (CHEMBL3876529)
EC50 4.0±n/a nM
Citation Higgins, MAMarcin, LRChristopher Zusi, FGentles, RDing, MPearce, BCEaston, AKostich, WASeager, MABourin, CBristow, LJJohnson, KAMiller, RHogan, JWhiterock, VGulianello, MFerrante, MHuang, YHendricson, AAlt, AMacor, JEBronson, JJ Triazolopyridine ethers as potent, orally active mGlu Bioorg Med Chem25:496-513 (2017) 
 
Metabotropic glutamate receptor 2
Name:Metabotropic glutamate receptor 2
Type:Enzyme
Mol. Mass.:95584.88
Organism:Homo sapiens (Human)
Description:Q14416
Residue:872
BDBM50209142
NameBDBM50209142
Synonyms:CHEMBL3884833
TypeSmall organic molecule
Emp. Form.C21H19ClF3N3O
Mol. Mass.421.843
SMILESFC(F)(F)c1c(OC[C@@H]2C[C@H]2c2ccc(Cl)cc2)ccn2c(CC3CC3)nnc12