Reaction Details
TargetCarbonic anhydrase 2
LigandBDBM50209224
Substrate/Competitorn/a
Meas. Tech.ChEBML_1633808
Ki 5.6±n/a nM
Citation Angapelly, SRamya, PVAngeli, AMonti, SMBuonanno, MAlvala, MSupuran, CTArifuddin, M Discovery of 4-sulfamoyl-phenyl-ß-lactams as a new class of potent carbonic anhydrase isoforms I, II, IV and VII inhibitors: The first example of subnanomolar CA IV inhibitors. Bioorg Med Chem25:539-544 (2017) 
 
Carbonic anhydrase 2
Name:Carbonic anhydrase 2
Type:Enzyme
Mol. Mass.:29250.71
Organism:Homo sapiens (Human)
Description:P00918
Residue:260
BDBM50209224
NameBDBM50209224
Synonyms:CHEMBL3885126
TypeSmall organic molecule
Emp. Form.C23H22N2O5S
Mol. Mass.438.496
SMILESCOc1ccc([C@H]2[C@@H](C(=O)N2c2ccc(cc2)S(N)(=O)=O)c2ccccc2)c(OC)c1