Reaction Details
TargetCarbonic anhydrase 2
LigandBDBM50209226
Substrate/Competitorn/a
Meas. Tech.ChEBML_1633808
Ki 2.8±n/a nM
Citation Angapelly, SRamya, PVAngeli, AMonti, SMBuonanno, MAlvala, MSupuran, CTArifuddin, M Discovery of 4-sulfamoyl-phenyl-ß-lactams as a new class of potent carbonic anhydrase isoforms I, II, IV and VII inhibitors: The first example of subnanomolar CA IV inhibitors. Bioorg Med Chem25:539-544 (2017) 
 
Carbonic anhydrase 2
Name:Carbonic anhydrase 2
Type:Enzyme
Mol. Mass.:29250.71
Organism:Homo sapiens (Human)
Description:P00918
Residue:260
BDBM50209226
NameBDBM50209226
Synonyms:CHEMBL3884755
TypeSmall organic molecule
Emp. Form.C24H24N2O6S
Mol. Mass.468.522
SMILESCOc1ccc([C@H]2[C@@H](C(=O)N2c2ccc(cc2)S(N)(=O)=O)c2ccccc2)c(OC)c1OC