Reaction Details
TargetCarbonic anhydrase 4
LigandBDBM50209287
Substrate/Competitorn/a
Meas. Tech.ChEBML_1633809
Ki 7.4±n/a nM
Citation Angapelly, SRamya, PVAngeli, AMonti, SMBuonanno, MAlvala, MSupuran, CTArifuddin, M Discovery of 4-sulfamoyl-phenyl-ß-lactams as a new class of potent carbonic anhydrase isoforms I, II, IV and VII inhibitors: The first example of subnanomolar CA IV inhibitors. Bioorg Med Chem25:539-544 (2017) 
 
Carbonic anhydrase 4
Name:Carbonic anhydrase 4
Type:Enzyme
Mol. Mass.:35037.98
Organism:Homo sapiens (Human)
Description:P22748
Residue:312
BDBM50209287
NameBDBM50209287
Synonyms:CHEMBL3884217
TypeSmall organic molecule
Emp. Form.C21H20N2O5S2
Mol. Mass.444.524
SMILESCOc1ccc(cc1OC)[C@H]1[C@@H](C(=O)N1c1ccc(cc1)S(N)(=O)=O)c1cccs1