Reaction Details
TargetCarbonic anhydrase 1
LigandBDBM50209283
Substrate/Competitorn/a
Meas. Tech.ChEBML_1633807
Ki 7.5±n/a nM
Citation Angapelly, SRamya, PVAngeli, AMonti, SMBuonanno, MAlvala, MSupuran, CTArifuddin, M Discovery of 4-sulfamoyl-phenyl-ß-lactams as a new class of potent carbonic anhydrase isoforms I, II, IV and VII inhibitors: The first example of subnanomolar CA IV inhibitors. Bioorg Med Chem25:539-544 (2017) 
 
Carbonic anhydrase 1
Name:Carbonic anhydrase 1
Type:Enzyme
Mol. Mass.:28873.37
Organism:Homo sapiens (Human)
Description:P00915
Residue:261
BDBM50209283
NameBDBM50209283
Synonyms:CHEMBL3885230
TypeSmall organic molecule
Emp. Form.C24H24N2O6S
Mol. Mass.468.522
SMILESCOc1ccc(cc1)[C@H]1[C@@H](N(C1=O)c1ccc(cc1)S(N)(=O)=O)c1ccc(OC)c(OC)c1