Reaction Details
TargetCarbonic anhydrase 4
LigandBDBM50209292
Substrate/Competitorn/a
Meas. Tech.ChEMBL_1633809 (CHEMBL3876601)
Ki 36±n/a nM
Citation Angapelly, SRamya, PVAngeli, AMonti, SMBuonanno, MAlvala, MSupuran, CTArifuddin, M Discovery of 4-sulfamoyl-phenyl-ß-lactams as a new class of potent carbonic anhydrase isoforms I, II, IV and VII inhibitors: The first example of subnanomolar CA IV inhibitors. Bioorg Med Chem25:539-544 (2017) 
 
Carbonic anhydrase 4
Name:Carbonic anhydrase 4
Type:Enzyme
Mol. Mass.:35037.98
Organism:Homo sapiens (Human)
Description:P22748
Residue:312
BDBM50209292
NameBDBM50209292
Synonyms:CHEMBL3884793
TypeSmall organic molecule
Emp. Form.C23H22N2O5S
Mol. Mass.438.496
SMILESCOc1ccc(OC)c(c1)[C@H]1[C@@H](C(=O)N1c1ccc(cc1)S(N)(=O)=O)c1ccccc1