Reaction Details
TargetCarbonic anhydrase 2
LigandBDBM50209286
Substrate/Competitorn/a
Meas. Tech.ChEMBL_1633808 (CHEMBL3876600)
Ki 8.5±n/a nM
Citation Angapelly, SRamya, PVAngeli, AMonti, SMBuonanno, MAlvala, MSupuran, CTArifuddin, M Discovery of 4-sulfamoyl-phenyl-ß-lactams as a new class of potent carbonic anhydrase isoforms I, II, IV and VII inhibitors: The first example of subnanomolar CA IV inhibitors. Bioorg Med Chem25:539-544 (2017) 
 
Carbonic anhydrase 2
Name:Carbonic anhydrase 2
Type:Enzyme
Mol. Mass.:29250.71
Organism:Homo sapiens (Human)
Description:P00918
Residue:260
BDBM50209286
NameBDBM50209286
Synonyms:CHEMBL3884261
TypeSmall organic molecule
Emp. Form.C21H20N2O5S2
Mol. Mass.444.524
SMILESCOc1ccc(OC)c(c1)[C@H]1[C@@H](C(=O)N1c1ccc(cc1)S(N)(=O)=O)c1cccs1