Reaction Details
TargetCarbonic anhydrase 2
LigandBDBM50209283
Substrate/Competitorn/a
Meas. Tech.ChEMBL_1633808 (CHEMBL3876600)
Ki 0.870000±n/a nM
Citation Angapelly, SRamya, PVAngeli, AMonti, SMBuonanno, MAlvala, MSupuran, CTArifuddin, M Discovery of 4-sulfamoyl-phenyl-ß-lactams as a new class of potent carbonic anhydrase isoforms I, II, IV and VII inhibitors: The first example of subnanomolar CA IV inhibitors. Bioorg Med Chem25:539-544 (2017) 
 
Carbonic anhydrase 2
Name:Carbonic anhydrase 2
Type:Enzyme
Mol. Mass.:29250.71
Organism:Homo sapiens (Human)
Description:P00918
Residue:260
BDBM50209283
NameBDBM50209283
Synonyms:CHEMBL3885230
TypeSmall organic molecule
Emp. Form.C24H24N2O6S
Mol. Mass.468.522
SMILESCOc1ccc(cc1)[C@H]1[C@@H](N(C1=O)c1ccc(cc1)S(N)(=O)=O)c1ccc(OC)c(OC)c1