Reaction Details
TargetCarbonic anhydrase 4
LigandBDBM50209225
Substrate/Competitorn/a
Meas. Tech.ChEMBL_1633809 (CHEMBL3876601)
Ki 0.650000±n/a nM
Citation Angapelly, SRamya, PVAngeli, AMonti, SMBuonanno, MAlvala, MSupuran, CTArifuddin, M Discovery of 4-sulfamoyl-phenyl-ß-lactams as a new class of potent carbonic anhydrase isoforms I, II, IV and VII inhibitors: The first example of subnanomolar CA IV inhibitors. Bioorg Med Chem25:539-544 (2017) 
 
Carbonic anhydrase 4
Name:Carbonic anhydrase 4
Type:Enzyme
Mol. Mass.:35037.98
Organism:Homo sapiens (Human)
Description:P22748
Residue:312
BDBM50209225
NameBDBM50209225
Synonyms:CHEMBL3883807
TypeSmall organic molecule
Emp. Form.C22H22N2O6S2
Mol. Mass.474.55
SMILESCOc1cc(OC)c([C@H]2[C@@H](C(=O)N2c2ccc(cc2)S(N)(=O)=O)c2cccs2)c(OC)c1