Reaction Details
TargetMitogen-activated protein kinase 1
LigandBDBM50209660
Substrate/Competitorn/a
Meas. Tech.ChEMBL_1633898 (CHEMBL3876690)
IC50 4620±n/a nM
Citation Tan, LGurbani, DWeisberg, ELHunter, JCLi, LJones, DSFicarro, SBMowafy, STam, CPRao, SDu, GGriffin, JDSorger, PKMarto, JAWestover, KDGray, NS Structure-guided development of covalent TAK1 inhibitors. Bioorg Med Chem25:838-846 (2017) 
 
Mitogen-activated protein kinase 1
Name:Mitogen-activated protein kinase 1
Type:Ser/Thr Protein Kinase
Mol. Mass.:41392.76
Organism:Homo sapiens (Human)
Description:P28482
Residue:360
BDBM50209660
NameBDBM50209660
Synonyms:CHEMBL3884281
TypeSmall organic molecule
Emp. Form.C21H21ClN6O3
Mol. Mass.440.883
SMILESClc1cnc(Nc2cnn(c2)C2CCOCC2)nc1Oc1ccccc1NC(=O)C=C