Reaction Details
TargetMitogen-activated protein kinase kinase kinase 7
LigandBDBM50209755
Substrate/Competitorn/a
Meas. Tech.ChEMBL_1633896 (CHEMBL3876688)
IC50 57±n/a nM
Citation Tan, LGurbani, DWeisberg, ELHunter, JCLi, LJones, DSFicarro, SBMowafy, STam, CPRao, SDu, GGriffin, JDSorger, PKMarto, JAWestover, KDGray, NS Structure-guided development of covalent TAK1 inhibitors. Bioorg Med Chem25:838-846 (2017) 
 
Mitogen-activated protein kinase kinase kinase 7
Name:Mitogen-activated protein kinase kinase kinase 7
Type:Protein
Mol. Mass.:67199.89
Organism:Homo sapiens (Human)
Description:O43318
Residue:606
BDBM50209755
NameBDBM50209755
Synonyms:CHEMBL3884914
TypeSmall organic molecule
Emp. Form.C27H30N6O2
Mol. Mass.470.5661
SMILESCN1CCN(CC1)c1ccc(Nc2ncc(C3CC3)c(Oc3ccccc3NC(=O)C=C)n2)cc1