Reaction Details
TargetDual specificity mitogen-activated protein kinase kinase 1
LigandBDBM50209652
Substrate/Competitorn/a
Meas. Tech.ChEMBL_1633897 (CHEMBL3876689)
IC50 4470±n/a nM
Citation Tan, LGurbani, DWeisberg, ELHunter, JCLi, LJones, DSFicarro, SBMowafy, STam, CPRao, SDu, GGriffin, JDSorger, PKMarto, JAWestover, KDGray, NS Structure-guided development of covalent TAK1 inhibitors. Bioorg Med Chem25:838-846 (2017) 
 
Dual specificity mitogen-activated protein kinase kinase 1
Name:Dual specificity mitogen-activated protein kinase kinase 1
Type:Other Protein Type
Mol. Mass.:43439.03
Organism:Homo sapiens (Human)
Description:Full-length human MEK-1 was generated by PCR and purified as a fusion protein from Escherichia coli lysates.
Residue:393
BDBM50209652
NameBDBM50209652
Synonyms:CHEMBL3884555
TypeSmall organic molecule
Emp. Form.C24H26N6O2
Mol. Mass.430.5022
SMILESCN1CCN(CC1)c1ccc(Nc2nccc(Oc3ccccc3NC(=O)C=C)n2)cc1