Reaction Details
TargetMitogen-activated protein kinase kinase kinase 7
LigandBDBM50209759
Substrate/Competitorn/a
Meas. Tech.ChEMBL_1633896 (CHEMBL3876688)
IC50 2.4±n/a nM
Citation Tan, LGurbani, DWeisberg, ELHunter, JCLi, LJones, DSFicarro, SBMowafy, STam, CPRao, SDu, GGriffin, JDSorger, PKMarto, JAWestover, KDGray, NS Structure-guided development of covalent TAK1 inhibitors. Bioorg Med Chem25:838-846 (2017) 
 
Mitogen-activated protein kinase kinase kinase 7
Name:Mitogen-activated protein kinase kinase kinase 7
Type:Protein
Mol. Mass.:67199.89
Organism:Homo sapiens (Human)
Description:O43318
Residue:606
BDBM50209759
NameBDBM50209759
Synonyms:CHEMBL3884839
TypeSmall organic molecule
Emp. Form.C19H19ClN6O3
Mol. Mass.414.846
SMILESCOCCn1cc(Nc2ncc(Cl)c(Oc3ccccc3NC(=O)C=C)n2)cn1