Reaction Details
TargetMitogen-activated protein kinase kinase kinase 7
LigandBDBM50209758
Substrate/Competitorn/a
Meas. Tech.ChEMBL_1633896 (CHEMBL3876688)
IC50 7.3±n/a nM
Citation Tan, LGurbani, DWeisberg, ELHunter, JCLi, LJones, DSFicarro, SBMowafy, STam, CPRao, SDu, GGriffin, JDSorger, PKMarto, JAWestover, KDGray, NS Structure-guided development of covalent TAK1 inhibitors. Bioorg Med Chem25:838-846 (2017) 
 
Mitogen-activated protein kinase kinase kinase 7
Name:Mitogen-activated protein kinase kinase kinase 7
Type:Protein
Mol. Mass.:67199.89
Organism:Homo sapiens (Human)
Description:O43318
Residue:606
BDBM50209758
NameBDBM50209758
Synonyms:CHEMBL3884143
TypeSmall organic molecule
Emp. Form.C17H15ClN6O2
Mol. Mass.370.793
SMILESCn1cc(Nc2ncc(Cl)c(Oc3ccccc3NC(=O)C=C)n2)cn1