Reaction Details
TargetDual specificity mitogen-activated protein kinase kinase 1
LigandBDBM50209760
Substrate/Competitorn/a
Meas. Tech.ChEMBL_1633897 (CHEMBL3876689)
IC50 9.5±n/a nM
Citation Tan, LGurbani, DWeisberg, ELHunter, JCLi, LJones, DSFicarro, SBMowafy, STam, CPRao, SDu, GGriffin, JDSorger, PKMarto, JAWestover, KDGray, NS Structure-guided development of covalent TAK1 inhibitors. Bioorg Med Chem25:838-846 (2017) 
 
Dual specificity mitogen-activated protein kinase kinase 1
Name:Dual specificity mitogen-activated protein kinase kinase 1
Type:Other Protein Type
Mol. Mass.:43439.03
Organism:Homo sapiens (Human)
Description:Full-length human MEK-1 was generated by PCR and purified as a fusion protein from Escherichia coli lysates.
Residue:393
BDBM50209760
NameBDBM50209760
Synonyms:CHEMBL3885421
TypeSmall organic molecule
Emp. Form.C25H25ClN6O3
Mol. Mass.492.957
SMILESCC(=O)N1CCN(CC1)c1cccc(Nc2ncc(Cl)c(Nc3ccccc3OC(=O)C=C)n2)c1