Reaction Details
TargetHistone deacetylase 1
LigandBDBM50209791
Substrate/Competitorn/a
Meas. Tech.ChEBML_1634157
IC50 60±n/a nM
Citation Raji, IYadudu, FJaneira, EFathi, SSzymczak, LKornacki, JRKomatsu, KLi, JDMrksich, MOyelere, AK Bifunctional conjugates with potent inhibitory activity towards cyclooxygenase and histone deacetylase. Bioorg Med Chem25:1202-1218 (2017) 
 
Histone deacetylase 1
Name:Histone deacetylase 1
Type:Enzyme
Mol. Mass.:55090.27
Organism:Homo sapiens (Human)
Description:Q13547
Residue:482
BDBM50209791
NameBDBM50209791
Synonyms:CHEMBL3883560
TypeSmall organic molecule
Emp. Form.C25H31N5O5S
Mol. Mass.513.609
SMILESCc1ccc(cc1)-c1cc(nn1-c1ccc(cc1)S(N)(=O)=O)C(=O)NCCCCCCCC(=O)NO