Reaction Details
TargetHistone deacetylase 6
LigandBDBM50209791
Substrate/Competitorn/a
Meas. Tech.ChEMBL_1634161 (CHEMBL3876953)
IC50 183±n/a nM
Citation Raji, IYadudu, FJaneira, EFathi, SSzymczak, LKornacki, JRKomatsu, KLi, JDMrksich, MOyelere, AK Bifunctional conjugates with potent inhibitory activity towards cyclooxygenase and histone deacetylase. Bioorg Med Chem25:1202-1218 (2017) 
 
Histone deacetylase 6
Name:Histone deacetylase 6
Type:Chromatin regulator; hydrolase; repressor
Mol. Mass.:131381.51
Organism:Homo sapiens (Human)
Description:Q9UBN7
Residue:1215
BDBM50209791
NameBDBM50209791
Synonyms:CHEMBL3883560
TypeSmall organic molecule
Emp. Form.C25H31N5O5S
Mol. Mass.513.609
SMILESCc1ccc(cc1)-c1cc(nn1-c1ccc(cc1)S(N)(=O)=O)C(=O)NCCCCCCCC(=O)NO