Reaction Details
TargetHistone deacetylase 3
LigandBDBM50209798
Substrate/Competitorn/a
Meas. Tech.ChEMBL_1634160 (CHEMBL3876952)
IC50 224±n/a nM
Citation Raji, IYadudu, FJaneira, EFathi, SSzymczak, LKornacki, JRKomatsu, KLi, JDMrksich, MOyelere, AK Bifunctional conjugates with potent inhibitory activity towards cyclooxygenase and histone deacetylase. Bioorg Med Chem25:1202-1218 (2017) 
 
Histone deacetylase 3
Name:Histone deacetylase 3
Type:Enzyme
Mol. Mass.:48829.55
Organism:Homo sapiens (Human)
Description:O15379
Residue:428
BDBM50209798
NameBDBM50209798
Synonyms:CHEMBL3884552
TypeSmall organic molecule
Emp. Form.C28H33N5O5
Mol. Mass.519.5921
SMILESCOC(=O)Cc1c(C)n(Cc2ccc(cc2)-c2cn(CCCCCC(=O)NO)nn2)c2ccc(OC)cc12