Reaction Details
TargetHistone deacetylase 3
LigandBDBM50209796
Substrate/Competitorn/a
Meas. Tech.ChEMBL_1634160 (CHEMBL3876952)
IC50 181±n/a nM
Citation Raji, IYadudu, FJaneira, EFathi, SSzymczak, LKornacki, JRKomatsu, KLi, JDMrksich, MOyelere, AK Bifunctional conjugates with potent inhibitory activity towards cyclooxygenase and histone deacetylase. Bioorg Med Chem25:1202-1218 (2017) 
 
Histone deacetylase 3
Name:Histone deacetylase 3
Type:Enzyme
Mol. Mass.:48829.55
Organism:Homo sapiens (Human)
Description:O15379
Residue:428
BDBM50209796
NameBDBM50209796
Synonyms:CHEMBL3885011
TypeSmall organic molecule
Emp. Form.C30H37N5O5
Mol. Mass.547.6453
SMILESCOC(=O)Cc1c(C)n(Cc2ccc(cc2)-c2cn(CCCCCCCC(=O)NO)nn2)c2ccc(OC)cc12