Reaction Details
Target5-hydroxytryptamine receptor 1A
LigandBDBM50209843
Substrate/Competitorn/a
Meas. Tech.ChEMBL_1634227 (CHEMBL3877019)
Ki 3.0±n/a nM
Citation Intagliata, SModica, MNPittalą, VSalerno, LSiracusa, MACagnotto, ASalmona, MKurczab, RRomeo, G New N- and O-arylpiperazinylalkyl pyrimidines and 2-methylquinazolines derivatives as 5-HT Bioorg Med Chem25:1250-1259 (2017) 
 
5-hydroxytryptamine receptor 1A
Name:5-hydroxytryptamine receptor 1A
Type:n/a
Mol. Mass.:46122.49
Organism:Homo sapiens (Human)
Description:n/a
Residue:422
BDBM50209843
NameBDBM50209843
Synonyms:CHEMBL3884095
TypeSmall organic molecule
Emp. Form.C26H34N4O2
Mol. Mass.434.5738
SMILESCCOc1ccccc1N1CCN(CCCCCn2c(C)nc3ccccc3c2=O)CC1